{"text_format":"1","workbook":"xlsx","n_sheets":2,"sheets":["DataEntry","Schools List"],"not_rendered":{"charts":0,"images":1,"macros":1,"external_links":0,"defined_names":1,"comments":0,"pivot_tables":0},"unopened":[],"bounds":{"document_bytes":16777216,"sheet_cells":100000,"rows_first":2000,"rows_last":500,"rows_between":2000,"halvings":0,"cell_chars":16384,"cell_head_chars":4096},"cells_cut":0,"cells_raw":0,"read":"whole","date_system":"1900"}

{"sheet":"DataEntry","index":0,"n_rows":2502,"n_cols":16,"rows_kept":2502,"cut":false,"hidden":false,"merged":[[15,12,17,12],[8,3,8,11],[6,1,6,11],[15,3,17,3],[15,11,17,11],[16,10,17,10],[10,1,10,4],[11,5,11,12],[7,1,7,11],[15,0,17,0],[1,2,1,9],[3,2,3,9],[15,1,17,1],[15,2,17,2],[15,4,15,10],[4,1,4,11],[5,1,5,11],[9,1,9,4]]}
[]
[null,null,"2025 BACK TO SCHOOL PAYMENT SCHEME"]
[]
[null,null,"FINANCIAL ACQUITTAL REPORT"]
[null,{"$f":"IF(COUNTIF(N:N,\"False*\"),\"Please review acquittal as Unique Student Numbers (UPNs) are listed more than once\",\"-\")","v":"-"}]
[null,{"$f":"IF(COUNTIF(O:O,\"False*\"),\"Please review acquittal as students are claiming more than the maximum amount of $200.00 per student\",\"-\")","v":"-"}]
[null,{"$f":"IF(COUNTIF(P:P,\"False*\"),\"Please review acquittal as all students have not been allocated a UPN\",\"-\")","v":"-"}]
[null,{"$f":"IF(F12=\"Yes\",IF(INDEX('Schools List'!J:J,MATCH(DataEntry!B10,'Schools List'!I:I,0))=\"Yes\",\"-\", \"Please review option to hold over remaining funds\"),\"-\")","v":"-"}]
[null,null,null,"I certify that the details presented are accurate and adhere to the Back To School Payment Scheme Policy and Guidelines. "]
["School:","Please select your school from this drop-down menu. "]
["Term(s):","Please select the term from this drop-down menu"]
["Do you wish to hold over remaining funds for Term 2 - 4 acquittal? ",null,null,null,null,"Please select from this drop-down menu (Only if your school has a pre-school) ."]
[]
[null,null,null,"Name of Principal",null,null,null,"Signature of Principal",null,null,null,"Date "]
[null,null,null,null,null,null,null,"Please send Excel and signed PDF copy to: ",null,null,null,null,"backtoschool.DET@education.nt.gov.au"]
["Student \nSurname","Student First \nName","Unique Student \nNumber (UPN)","Year Group","How was the \nentitlement used - ",null,null,null,null,null,null,"Amount Acquitted","Balance Remaining per student"]
[null,null,null,null,"Textbooks","Stationery","Uniforms","Excursions","Travel Costs","Other","If Other Specify"]
[null,null,null,null,{"$f":"SUM(E19:E3001)","v":0},{"$f":"SUM(F19:F3001)","v":0},0,0,0,0]
[null,null,null,null,null,null,null,null,null,null,null,{"$f":"SUM(E19:J19)","v":0},{"$f":"200-L19","v":200},{"$f":"IF(COUNTIF(C:C,C19)>1,\"False\",\"True\")","v":"True"},{"$f":"IF(L19>200,\"False\",\"True\")","v":"True"},{"$f":"IF(AND(L19=0,C19=\"\"),\"True\",IF(AND(L19<>0,C19=\"\"),\"False\",\"True\"))","v":"True"}]
[null,null,null,null,null,null,null,null,null,null,null,{"$f":"SUM(E20:J20)","v":0},{"$f":"200-L20","v":200},"True",{"$f":"IF(L20>200,\"False\",\"True\")","v":"True"},{"$f":"IF(AND(L20=0,C20=\"\"),\"True\",IF(AND(L20<>0,C20=\"\"),\"False\",\"True\"))","v":"True"}]
[null,null,null,null,null,null,null,null,null,null,null,0,{"$f":"200-L21","v":200},"True","True","True"]
[null,null,null,null,null,null,null,null,null,null,null,0,200,"True","True","True"]
[null,null,null,null,null,null,null,null,null,null,null,0,200,"True","True","True"]
[null,null,null,null,null,null,null,null,null,null,null,0,200,"True","True","True"]
[null,null,null,null,null,null,null,null,null,null,null,0,200,"True","True","True"]
[null,null,null,null,null,null,null,null,null,null,null,0,200,"True","True","True"]
[null,null,null,null,null,null,null,null,null,null,null,0,200,"True","True","True"]
[null,null,null,null,null,null,null,null,null,null,null,0,200,"True","True","True"]
[null,null,null,null,null,null,null,null,null,null,null,0,200,"True","True","True"]
[null,null,null,null,null,null,null,null,null,null,null,0,200,"True","True","True"]
[null,null,null,null,null,null,null,null,null,null,null,0,200,"True","True","True"]
[null,null,null,null,null,null,null,null,null,null,null,0,200,"True","True","True"]
[null,null,null,null,null,null,null,null,null,null,null,0,200,"True","True","True"]
[null,null,null,null,null,null,null,null,null,null,null,0,200,"True","True","True"]
[null,null,null,null,null,null,null,null,null,null,null,0,200,"True","True","True"]
[null,null,null,null,null,null,null,null,null,null,null,0,200,"True","True","True"]
[null,null,null,null,null,null,null,null,null,null,null,0,200,"True","True","True"]
[null,null,null,null,null,null,null,null,null,null,null,0,200,"True","True","True"]
[null,null,null,null,null,null,null,null,null,null,null,0,200,"True","True","True"]
[null,null,null,null,null,null,null,null,null,null,null,0,200,"True","True","True"]
[null,null,null,null,null,null,null,null,null,null,null,0,200,"True","True","True"]
[null,null,null,null,null,null,null,null,null,null,null,0,200,"True","True","True"]
[null,null,null,null,null,null,null,null,null,null,null,0,200,"True","True","True"]
[null,null,null,null,null,null,null,null,null,null,null,0,200,"True","True","True"]
[null,null,null,null,null,null,null,null,null,null,null,0,200,"True","True","True"]
[null,null,null,null,null,null,null,null,null,null,null,0,200,"True","True","True"]
[null,null,null,null,null,null,null,null,null,null,null,0,200,"True","True","True"]
[null,null,null,null,null,null,null,null,null,null,null,0,200,"True","True","True"]
[null,null,null,null,null,null,null,null,null,null,null,0,200,"True","True","True"]
[null,null,null,null,null,null,null,null,null,null,null,0,200,"True","True","True"]
[null,null,null,null,null,null,null,null,null,null,null,0,200,"True","True","True"]
[null,null,null,null,null,null,null,null,null,null,null,0,200,"True","True","True"]
[null,null,null,null,null,null,null,null,null,null,null,0,200,"True","True","True"]
[null,null,null,null,null,null,null,null,null,null,null,0,200,"True","True","True"]
[null,null,null,null,null,null,null,null,null,null,null,0,200,"True","True","True"]
[null,null,null,null,null,null,null,null,null,null,null,0,200,"True","True","True"]
[null,null,null,null,null,null,null,null,null,null,null,0,200,"True","True","True"]
[null,null,null,null,null,null,null,null,null,null,null,0,200,"True","True","True"]
[null,null,null,null,null,null,null,null,null,null,null,0,200,"True","True","True"]
[null,null,null,null,null,null,null,null,null,null,null,0,200,"True","True","True"]
[null,null,null,null,null,null,null,null,null,null,null,0,200,"True","True","True"]
[null,null,null,null,null,null,null,null,null,null,null,0,200,"True","True","True"]
[null,null,null,null,null,null,null,null,null,null,null,0,200,"True","True","True"]
[null,null,null,null,null,null,null,null,null,null,null,0,200,"True","True","True"]
[null,null,null,null,null,null,null,null,null,null,null,0,200,"True","True","True"]
[null,null,null,null,null,null,null,null,null,null,null,0,200,"True","True","True"]
[null,null,null,null,null,null,null,null,null,null,null,0,200,"True","True","True"]
[null,null,null,null,null,null,null,null,null,null,null,0,200,"True","True","True"]
[null,null,null,null,null,null,null,null,null,null,null,0,200,"True","True","True"]
[null,null,null,null,null,null,null,null,null,null,null,0,200,"True","True","True"]
[null,null,null,null,null,null,null,null,null,null,null,0,200,"True","True","True"]
[null,null,null,null,null,null,null,null,null,null,null,0,200,"True","True","True"]
[null,null,null,null,null,null,null,null,null,null,null,0,200,"True","True","True"]
[null,null,null,null,null,null,null,null,null,null,null,0,200,"True","True","True"]
[null,null,null,null,null,null,null,null,null,null,null,0,200,"True","True","True"]
[null,null,null,null,null,null,null,null,null,null,null,0,200,"True","True","True"]
[null,null,null,null,null,null,null,null,null,null,null,0,200,"True","True","True"]
[null,null,null,null,null,null,null,null,null,null,null,0,200,"True","True","True"]
[null,null,null,null,null,null,null,null,null,null,null,0,200,"True","True","True"]
[null,null,null,null,null,null,null,null,null,null,null,0,200,"True","True","True"]
[null,null,null,null,null,null,null,null,null,null,null,0,200,"True","True","True"]
[null,null,null,null,null,null,null,null,null,null,null,0,200,"True","True","True"]
[null,null,null,null,null,null,null,null,null,null,null,0,200,{"$f":"IF(COUNTIF(C:C,C83)>1,\"False\",\"True\")","v":"True"},"True","True"]
[null,null,null,null,null,null,null,null,null,null,null,{"$f":"SUM(E84:J84)","v":0},200,"True",{"$f":"IF(L84>200,\"False\",\"True\")","v":"True"},{"$f":"IF(AND(L84=0,C84=\"\"),\"True\",IF(AND(L84<>0,C84=\"\"),\"False\",\"True\"))","v":"True"}]
[null,null,null,null,null,null,null,null,null,null,null,0,{"$f":"200-L85","v":200},"True","True","True"]
[null,null,null,null,null,null,null,null,null,null,null,0,200,"True","True","True"]
[null,null,null,null,null,null,null,null,null,null,null,0,200,"True","True","True"]
[null,null,null,null,null,null,null,null,null,null,null,0,200,"True","True","True"]
[null,null,null,null,null,null,null,null,null,null,null,0,200,"True","True","True"]
[null,null,null,null,null,null,null,null,null,null,null,0,200,"True","True","True"]
[null,null,null,null,null,null,null,null,null,null,null,0,200,"True","True","True"]
[null,null,null,null,null,null,null,null,null,null,null,0,200,"True","True","True"]
[null,null,null,null,null,null,null,null,null,null,null,0,200,"True","True","True"]
[null,null,null,null,null,null,null,null,null,null,null,0,200,"True","True","True"]
[null,null,null,null,null,null,null,null,null,null,null,0,200,"True","True","True"]
[null,null,null,null,null,null,null,null,null,null,null,0,200,"True","True","True"]
[null,null,null,null,null,null,null,null,null,null,null,0,200,"True","True","True"]
[null,null,null,null,null,null,null,null,null,null,null,0,200,"True","True","True"]
[null,null,null,null,null,null,null,null,null,null,null,0,200,"True","True","True"]
[null,null,null,null,null,null,null,null,null,null,null,0,200,"True","True","True"]
[null,null,null,null,null,null,null,null,null,null,null,0,200,"True","True","True"]
[null,null,null,null,null,null,null,null,null,null,null,0,200,"True","True","True"]
[null,null,null,null,null,null,null,null,null,null,null,0,200,"True","True","True"]
[null,null,null,null,null,null,null,null,null,null,null,0,200,"True","True","True"]
[null,null,null,null,null,null,null,null,null,null,null,0,200,"True","True","True"]
[null,null,null,null,null,null,null,null,null,null,null,0,200,"True","True","True"]
[null,null,null,null,null,null,null,null,null,null,null,0,200,"True","True","True"]
[null,null,null,null,null,null,null,null,null,null,null,0,200,"True","True","True"]
[null,null,null,null,null,null,null,null,null,null,null,0,200,"True","True","True"]
[null,null,null,null,null,null,null,null,null,null,null,0,200,"True","True","True"]
[null,null,null,null,null,null,null,null,null,null,null,0,200,"True","True","True"]
[null,null,null,null,null,null,null,null,null,null,null,0,200,"True","True","True"]
[null,null,null,null,null,null,null,null,null,null,null,0,200,"True","True","True"]
[null,null,null,null,null,null,null,null,null,null,null,0,200,"True","True","True"]
[null,null,null,null,null,null,null,null,null,null,null,0,200,"True","True","True"]
[null,null,null,null,null,null,null,null,null,null,null,0,200,"True","True","True"]
[null,null,null,null,null,null,null,null,null,null,null,0,200,"True","True","True"]
[null,null,null,null,null,null,null,null,null,null,null,0,200,"True","True","True"]
[null,null,null,null,null,null,null,null,null,null,null,0,200,"True","True","True"]
[null,null,null,null,null,null,null,null,null,null,null,0,200,"True","True","True"]
{"$rows_left_out":2383}
{"sheet":"Schools List","index":1,"n_rows":202,"n_cols":10,"rows_kept":202,"cut":false,"hidden":true,"merged":[]}
["Please select your school from this drop-down menu. ",null,null,null,null,null,null,null,"Name","Is Pre School"]
["Acacia Hill School",null,null,null,null,null,null,null,"Acacia Hill School","Yes"]
["Adelaide River School",null,null,null,null,null,null,null,"Adelaide River School","Yes"]
["Alawa Primary School",null,null,null,null,null,null,null,"Alawa Primary School","Yes"]
["Alcoota School",null,null,null,null,null,null,null,"Alcoota School","Yes"]
["Alekarenge School",null,null,null,null,null,null,null,"Alekarenge School","Yes"]
["Alice Springs School Of The Air",null,null,null,null,null,null,null,"Alice Springs School Of The Air","Yes"]
["Alpurrurulam School",null,null,null,null,null,null,null,"Alice Springs Steiner School","Yes"]
["Alyangula Area School",null,null,null,null,null,null,null,"Alpurrurulam School","Yes"]
["Alyarrmandumanja Umbakumba School",null,null,null,null,null,null,null,"Alyangula Area School","Yes"]
["Amanbidji School",null,null,null,null,null,null,null,"Alyarrmandumanja Umbakumba School","Yes"]
["Amoonguna School",null,null,null,null,null,null,null,"Amanbidji School","Yes"]
["Ampilatwatja School",null,null,null,null,null,null,null,"Amoonguna School","No"]
["Angurugu School",null,null,null,null,null,null,null,"Ampilatwatja School","Yes"]
["Anula Primary School",null,null,null,null,null,null,null,"Angurugu School","Yes"]
["Araluen Christian College",null,null,null,null,null,null,null,"Anula Primary School","Yes"]
["Areyonga School",null,null,null,null,null,null,null,"Araluen Christian School","No"]
["Arlparra School",null,null,null,null,null,null,null,"Areyonga School","No"]
["Australian International Islamic College",null,null,null,null,null,null,null,"Arlparra School","Yes"]
["Bakewell Primary School",null,null,null,null,null,null,null,"Australian International Islamic College","No"]
["Baniyala Garrangali School",null,null,null,null,null,null,null,"Bakewell Primary School","Yes"]
["Barunga School",null,null,null,null,null,null,null,"Baniyala Garrangali School","Yes"]
["Batchelor Area School",null,null,null,null,null,null,null,"Barunga School","Yes"]
["Bees Creek Primary School",null,null,null,null,null,null,null,"Batchelor Area School","Yes"]
["Belyuen School",null,null,null,null,null,null,null,"Bees Creek Primary School","Yes"]
["Berry Springs Primary School",null,null,null,null,null,null,null,"Belyuen School","Yes"]
["Bonya School",null,null,null,null,null,null,null,"Berry Springs Primary School","Yes"]
["Borroloola School",null,null,null,null,null,null,null,"Bonya School","Yes"]
["Bradshaw Primary School",null,null,null,null,null,null,null,"Borroloola School","Yes"]
["Braitling Primary School",null,null,null,null,null,null,null,"Bradshaw Primary School","Yes"]
["Bulla Camp School",null,null,null,null,null,null,null,"Braitling Primary School","Yes"]
["Bulman School",null,null,null,null,null,null,null,"Bulla Camp School","Yes"]
["Canteen Creek School",null,null,null,null,null,null,null,"Bulman School","Yes"]
["Casuarina Senior College",null,null,null,null,null,null,null,"Canteen Creek School","Yes"]
["Casuarina Street Primary School",null,null,null,null,null,null,null,"Casuarina Senior College","No"]
["Centralian Middle School",null,null,null,null,null,null,null,"Casuarina Street Primary School","Yes"]
["Centralian Senior College",null,null,null,null,null,null,null,"Centralian Middle School","No"]
["Clyde Fenton Primary School",null,null,null,null,null,null,null,"Centralian Senior College","No"]
["Darwin High School",null,null,null,null,null,null,null,"Clyde Fenton Primary School","Yes"]
["Darwin Middle School",null,null,null,null,null,null,null,"Darwin High School","No"]
["Dhupuma Barker School",null,null,null,null,null,null,null,"Darwin Middle School","No"]
["Douglas Daly School",null,null,null,null,null,null,null,"Douglas Daly School","Yes"]
["Dripstone Middle School",null,null,null,null,null,null,null,"Dripstone Middle School","No"]
["Driver Primary School",null,null,null,null,null,null,null,"Driver Primary School","Yes"]
["Dundee Beach School",null,null,null,null,null,null,null,"Dundee Beach School","Yes"]
["Durack Primary School",null,null,null,null,null,null,null,"Durack Primary School","Yes"]
["Elliott School",null,null,null,null,null,null,null,"Elliott School","Yes"]
["Epenarra School",null,null,null,null,null,null,null,"Epenarra School","Yes"]
["Finke School",null,null,null,null,null,null,null,"Essington School","Yes"]
["Forrest Parade School",null,null,null,null,null,null,null,"Finke School","No"]
["Gapuwiyak School",null,null,null,null,null,null,null,"Forrest Parade School","No"]
["Gawa Christian School",null,null,null,null,null,null,null,"Gapuwiyak School","Yes"]
["Gillen Primary School",null,null,null,null,null,null,null,"Gawa Christian School","No"]
["Girraween Primary School",null,null,null,null,null,null,null,"Gillen Primary School","Yes"]
["Good Shepherd Lutheran College",null,null,null,null,null,null,null,"Girraween Primary School","Yes"]
["Gray Primary School",null,null,null,null,null,null,null,"Good Shepherd - Leanyer Campus","Yes"]
["Gunbalanya School",null,null,null,null,null,null,null,"Good Shepherd Lutheran College","Yes"]
["Haasts Bluff School",null,null,null,null,null,null,null,"Good Shepherd Lutheran School","No"]
["Haileybury Rendall School",null,null,null,null,null,null,null,"Gray Primary School","Yes"]
["Harts Range School",null,null,null,null,null,null,null,"Gunbalanya School","Yes"]
["Henbury School",null,null,null,null,null,null,null,"Haasts Bluff School","Yes"]
["Holy Family Catholic Primary School",null,null,null,null,null,null,null,"Haileybury Rendall School","No"]
["Holy Spirit Catholic Primary School",null,null,null,null,null,null,null,"Harts Range School","Yes"]
["Howard Springs Primary School",null,null,null,null,null,null,null,"Henbury School","No"]
["Humpty Doo Primary School",null,null,null,null,null,null,null,"Holy Family Catholic School","No"]
["Imanpa School",null,null,null,null,null,null,null,"Holy Spirit Catholic School","No"]
["Jabiru Area School",null,null,null,null,null,null,null,"Howard Springs Primary School","Yes"]
["Jilkminggan School",null,null,null,null,null,null,null,"Humpty Doo Primary School","Yes"]
["Jingili Primary School",null,null,null,null,null,null,null,"Imanpa School","No"]
["Kalkaringi School",null,null,null,null,null,null,null,"Jabiru Area School","Yes"]
["Karama Primary School",null,null,null,null,null,null,null,"Jilkminggan School","Yes"]
["Katherine High School",null,null,null,null,null,null,null,"Jingili Primary School","Yes"]
["Katherine School Of The Air",null,null,null,null,null,null,null,"Kalkaringi School","Yes"]
["Katherine South Primary School",null,null,null,null,null,null,null,"Karama Primary School","Yes"]
["Kintore Street School",null,null,null,null,null,null,null,"Katherine Flexible Learning Centre","No"]
["Lajamanu School",null,null,null,null,null,null,null,"Katherine High School","No"]
["Laramba School",null,null,null,null,null,null,null,"Katherine School Of The Air","Yes"]
["Larapinta Primary School",null,null,null,null,null,null,null,"Katherine South Primary School","Yes"]
["Larrakeyah Primary School",null,null,null,null,null,null,null,"Kiana School","Yes"]
["Laynhapuy Homelands School",null,null,null,null,null,null,null,"Kintore Street School","No"]
["Leanyer Primary School",null,null,null,null,null,null,null,"Lajamanu School","Yes"]
["Living Waters Lutheran School",null,null,null,null,null,null,null,"Laramba School","Yes"]
["Ltyentye Apurte Catholic School",null,null,null,null,null,null,null,"Larapinta Primary School","Yes"]
["Ludmilla Primary School",null,null,null,null,null,null,null,"Larrakeyah Primary School","Yes"]
["MacFarlane Primary School",null,null,null,null,null,null,null,"Laynhapuy Homelands School","No"]
["MacKillop Catholic College",null,null,null,null,null,null,null,"Leanyer Primary School","Yes"]
["Malak Primary School",null,null,null,null,null,null,null,"Living Waters Lutheran School","No"]
["Mamaruni School",null,null,null,null,null,null,null,"Ltyentye Apurte CEC","Yes"]
["Maningrida College",null,null,null,null,null,null,null,"Ludmilla Primary School","Yes"]
["Manunda Terrace Primary School",null,null,null,null,null,null,null,"MacFarlane Primary School","Yes"]
["Manyallaluk School",null,null,null,null,null,null,null,"Mackillop Catholic College","No"]
["Mäpuru Yirralka College",null,null,null,null,null,null,null,"Malak Primary School","Yes"]
["Marrara Christian College",null,null,null,null,null,null,null,"Mamaruni School","Yes"]
["Mataranka School",null,null,null,null,null,null,null,"Maningrida School","Yes"]
["Mbunghara School",null,null,null,null,null,null,null,"Manunda Terrace Primary School","Yes"]
["Middle Point School",null,null,null,null,null,null,null,"Manyallaluk School","Yes"]
["Milikapiti School",null,null,null,null,null,null,null,"Mapuru Yirralka College","No"]
["Milingimbi School",null,null,null,null,null,null,null,"Marrara Christian School","Yes"]
["Milkwood Steiner School",null,null,null,null,null,null,null,"Mataranka School","Yes"]
["Millner Primary School",null,null,null,null,null,null,null,"Mbunghara School","No"]
["Milyakburra School",null,null,null,null,null,null,null,"Middle Point School","No"]
["Minyerri School",null,null,null,null,null,null,null,"Milikapiti School","Yes"]
["Moil Primary School",null,null,null,null,null,null,null,"Milingimbi School","Yes"]
["Mother Teresa Catholic Primary School",null,null,null,null,null,null,null,"Milkwood Steiner","Yes"]
["Moulden Primary School",null,null,null,null,null,null,null,"Millner Primary School","Yes"]
["Mount Allan School",null,null,null,null,null,null,null,"Milyakburra School","Yes"]
["Mulga Bore School",null,null,null,null,null,null,null,"Minyerri School","Yes"]
["Murray Downs School",null,null,null,null,null,null,null,"Moil Pre School","Yes"]
["Murrupurtiyanuwu Catholic Primary School",null,null,null,null,null,null,null,"Moil Primary School","No"]
["Mutitjulu School",null,null,null,null,null,null,null,"Mother Teresa Catholic Primary School","No"]
["Nakara Primary School",null,null,null,null,null,null,null,"Moulden Primary School","Yes"]
["Nawarddeken Academy Kabulwarnamyo School",null,null,null,null,null,null,null,"Mount Allan School","Yes"]
["Nawarddeken Academy Mamadawerre School",null,null,null,null,null,null,null,"Mulga Bore School","Yes"]
["Nawarddeken Academy Manmoyi School",null,null,null,null,null,null,null,"Murray Downs School","Yes"]
["Nemarluk School",null,null,null,null,null,null,null,"Murrupurtiyanuwu Catholic Primary School","Yes"]
["Neutral Junction School",null,null,null,null,null,null,null,"Mutitjulu School","No"]
["Newcastle Waters School",null,null,null,null,null,null,null,"Nakara Primary School","Yes"]
["Nganambala School",null,null,null,null,null,null,null,"Nemarluk School","Yes"]
["Nganmarriyanga School",null,null,null,null,null,null,null,"Neutral Junction School","No"]
["Ngukurr School",null,null,null,null,null,null,null,"Newcastle Waters School","Yes"]
{"$rows_left_out":82}